Uploaded image for project: 'Swift'
  1. Swift
  2. SR-3658

Can't build CoreFoundation on Ubuntu 16.04, January 16

    XMLWordPrintable

    Details

    • Type: Bug
    • Status: Open
    • Priority: Medium
    • Resolution: Unresolved
    • Component/s: Compiler, Foundation
    • Labels:
    • Environment:

      Ubuntu 16.04

      Description

      I tried updating my Ubuntu 16.04 build to use the January 16, 2017 snapshot. Jan 15 failed the same way. Swift build can't seem to find Block.h, which appears to be in the tree. If I specify that directory explicitly so it can find it, then it can't find the C++ <vector> header.

      So something is definitely broken. My project builds fine with the Dec 13 release.

      This is the output that is repeated over and over
      -------------------------------------------------

      <module-includes>:1:10: note: in file included from <module-includes>:1:
      #include "CoreFoundation.h"
               ^
      /home/ed/swift/usr/lib/swift/CoreFoundation/CoreFoundation.h:56:10: note: in file included from /home/ed/swift/usr/lib/swift/CoreFoundation/CoreFoundation.h:56:
      #include <CoreFoundation/CFBase.h>
               ^
      /home/ed/swift/usr/lib/swift/CoreFoundation/CFBase.h:72:10: error: 'Block.h' file not found
      #include <Block.h>
               ^
      <unknown>:0: error: could not build Objective-C module 'CoreFoundation'
      <module-includes>:1:10: note: in file included from <module-includes>:1:
      #include "CoreFoundation.h"
               ^
      /home/ed/swift/usr/lib/swift/CoreFoundation/CoreFoundation.h:56:10: note: in file included from /home/ed/swift/usr/lib/swift/CoreFoundation/CoreFoundation.h:56:
      #include <CoreFoundation/CFBase.h>
               ^
      /home/ed/swift/usr/lib/swift/CoreFoundation/CFBase.h:72:10: error: 'Block.h' file not found
      #include <Block.h>
      
      etc....
      

      Any ideas??

        Attachments

          Issue Links

            Activity

              People

              Assignee:
              Unassigned Unassigned
              Reporter:
              ewconnell Edward Connell
              Votes:
              5 Vote for this issue
              Watchers:
              10 Start watching this issue

                Dates

                Created:
                Updated: